Target
Voltage-dependent N-type calcium channel subunit alpha-1B
Ligand
BDBM54754
Substrate
Meas. Tech.
Homogeneous Time-Resolved Fluorescence Resonance Energy Transfer (HTRF) Assay
IC50
3850±n/a nM
Citation
 PubChem, PC Homogeneous Time-Resolved Fluorescence Resonance Energy Transfer (HTRF) Assay PubChem Bioassay (2009)[AID] 
Target
Name:
Voltage-dependent N-type calcium channel subunit alpha-1B
Synonyms:
BIII CAC1B_HUMAN CACNA1B Calcium channel (Type N) Voltage-dependent N-type calcium channel subunit alpha-1B Voltage-gated N-type calcium channel alpha-1B subunit Voltage-gated calcium channel Voltage-gated calcium channel subunit alpha Cav2.2 ((alpha 1B, beta 1b, alpha 2 delta-1) | calcium channel, voltage-dependent, N type, alpha 1B subunit
Type:
Enzyme
Mol. Mass.:
262548.16
Organism:
Homo sapiens (Human)
Description:
Q00975
Residue:
2339
  
Inhibitor
Name:
BDBM54754
Synonyms:
3-[(4-ketocyclohexa-2,5-dien-1-ylidene)methyl]-2,4-dihydro-1H-cyclopenta[b]quinoline-9-carboxylic acid 3-[(4-oxo-1-cyclohexa-2,5-dienylidene)methyl]-2,4-dihydro-1H-cyclopenta[b]quinoline-9-carboxylic acid MLS000776136 cid_5908804
Type:
Small organic molecule
Emp. Form.:
C20H15NO3
Mol. Mass.:
317.338
SMILES:
OC(=O)c1c2CCC(=Cc3ccc(O)cc3)c2nc2ccccc12
: