Target
Voltage-dependent N-type calcium channel subunit alpha-1B
Ligand
BDBM35730
Substrate
Meas. Tech.
Homogeneous Time-Resolved Fluorescence Resonance Energy Transfer (HTRF) Assay
IC50
3860±n/a nM
Citation
 PubChem, PC Homogeneous Time-Resolved Fluorescence Resonance Energy Transfer (HTRF) Assay PubChem Bioassay (2009)[AID] 
Target
Name:
Voltage-dependent N-type calcium channel subunit alpha-1B
Synonyms:
BIII CAC1B_HUMAN CACNA1B Calcium channel (Type N) Voltage-dependent N-type calcium channel subunit alpha-1B Voltage-gated N-type calcium channel alpha-1B subunit Voltage-gated calcium channel Voltage-gated calcium channel subunit alpha Cav2.2 ((alpha 1B, beta 1b, alpha 2 delta-1) | calcium channel, voltage-dependent, N type, alpha 1B subunit
Type:
Enzyme
Mol. Mass.:
262548.16
Organism:
Homo sapiens (Human)
Description:
Q00975
Residue:
2339
  
Inhibitor
Name:
BDBM35730
Synonyms:
cid_694792 | sulfonamide deriv., 5e
Type:
Small organic molecule
Emp. Form.:
C13H14N2O3S2
Mol. Mass.:
310.392
SMILES:
NS(=O)(=O)c1ccc(CNC(=O)Cc2cccs2)cc1
: