Target
Neuropeptide Y receptor type 1
Ligand
BDBM61789
Substrate
Meas. Tech.
Fluorescence-based dose response cell-based high-throughput screening assay for agonists of NPY-Y1.
EC50
35430±n/a nM
Citation
 PubChem, PC Fluorescence-based dose response cell-based high-throughput screening assay for agonists of NPY-Y1. PubChem Bioassay (2009)[AID] 
Target
Name:
Neuropeptide Y receptor type 1
Synonyms:
NPY-Y1 NPY1R NPYR neuropeptide Y receptor Y1
Type:
Enzyme Catalytic Domain
Mol. Mass.:
44399.07
Organism:
Homo sapiens (Human)
Description:
NPY-Y1 NPY1R HUMAN::P25929
Residue:
384
  
Inhibitor
Name:
BDBM61789
Synonyms:
MLS000674641 N-[3-(3,5-dimethylpiperidin-1-yl)propyl]-1-methyl-4-oxidanylidene-5H-pyrrolo[3,2-c]quinoline-2-carboxamide N-[3-(3,5-dimethylpiperidin-1-yl)propyl]-1-methyl-4-oxo-5H-pyrrolo[3,2-c]quinoline-2-carboxamide SMR000314082 | cid_16194385
Type:
Small organic molecule
Emp. Form.:
C23H30N4O2
Mol. Mass.:
394.5099
SMILES:
CC1CC(C)CN(CCCNC(=O)c2cc3c(n2C)c2ccccc2[nH]c3=O)C1
: