Target
Neuropeptide Y receptor type 2
Ligand
BDBM61844
Substrate
Meas. Tech.
Fluorescence-based cell-based high-throughput dose response assay for agonists of NPY-Y2.
EC50
>35430±n/a nM
Citation
 PubChem, PC Fluorescence-based cell-based high-throughput dose response assay for agonists of NPY-Y2. PubChem Bioassay (2009)[AID] 
Target
Name:
Neuropeptide Y receptor type 2
Synonyms:
NPY-Y2 NPY2-R NPY2R_HUMAN Y2 receptor | neuropeptide Y receptor Y2
Type:
Enzyme Catalytic Domain
Mol. Mass.:
42734.65
Organism:
Homo sapiens (Human)
Description:
NPY-Y2 NPY2R HUMAN::P49146
Residue:
381
  
Inhibitor
Name:
BDBM61844
Synonyms:
8-(benzylthio)-7H-purine 8-(phenylmethylthio)-7H-purine MLS000736988 cid_236401
Type:
Small organic molecule
Emp. Form.:
C12H10N4S
Mol. Mass.:
242.3
SMILES:
C(Sc1nc2ncncc2[nH]1)c1ccccc1
: