Target
Neuropeptide Y receptor type 1
Ligand
BDBM61795
Substrate
Meas. Tech.
Fluorescence-based counterscreen for agonists of NPY-Y2: cell-based high-throughput dose response assay for agonists of NPY-Y1.
EC50
8504±n/a nM
Citation
 PubChem, PC Fluorescence-based counterscreen for agonists of NPY-Y2: cell-based high-throughput dose response assay for agonists of NPY-Y1. PubChem Bioassay (2009)[AID] 
Target
Name:
Neuropeptide Y receptor type 1
Synonyms:
NPY-Y1 NPY1R NPYR neuropeptide Y receptor Y1
Type:
Enzyme Catalytic Domain
Mol. Mass.:
44399.07
Organism:
Homo sapiens (Human)
Description:
NPY-Y1 NPY1R HUMAN::P25929
Residue:
384
  
Inhibitor
Name:
BDBM61795
Synonyms:
1-(2-allylphenoxy)-3-[4-(4-methylphenyl)piperazin-1-yl]propan-2-ol 1-[4-(4-methylphenyl)-1-piperazinyl]-3-(2-prop-2-enylphenoxy)-2-propanol MLS000089771 cid_3237370
Type:
Small organic molecule
Emp. Form.:
C23H30N2O2
Mol. Mass.:
366.4965
SMILES:
Cc1ccc(cc1)N1CCN(CC(O)COc2ccccc2CC=C)CC1
: