Target
Procathepsin L
Ligand
BDBM60057
Substrate
Meas. Tech.
Counterscreen for inhibitors of M1 and M17 aminopeptidases: QFRET-based biochemical high throughput dose response assay for inhibitors of the Cathepsin L proteinase (CTSL1).
IC50
>59642±n/a nM
Citation
 PubChem, PC Counterscreen for inhibitors of M1 and M17 aminopeptidases: QFRET-based biochemical high throughput dose response assay for inhibitors of the Cathepsin L proteinase (CTSL1). PubChem Bioassay (2009)[AID] 
Target
Name:
Procathepsin L
Synonyms:
CATL1_HUMAN CTSL CTSL1 Cathepsin L Cathepsin L1 heavy chain MEP cathepsin L preproprotein
Type:
Enzyme
Mol. Mass.:
37557.19
Organism:
Homo sapiens (Human)
Description:
Purchased from Calbiochem (San Diego, CA).
Residue:
333
  
Inhibitor
Name:
BDBM60057
Synonyms:
MLS000698754 N-(1,2-dihydroacenaphthylen-5-yl)-2-(6-hydroxy-4-oxo-1-phenylpyrimidin-2-yl)sulfanylacetamide N-(1,2-dihydroacenaphthylen-5-yl)-2-[(6-hydroxy-4-oxo-1-phenyl-2-pyrimidinyl)thio]acetamide SMR000226481 | cid_1208699
Type:
Small organic molecule
Emp. Form.:
C24H19N3O3S
Mol. Mass.:
429.491
SMILES:
Oc1cc(=O)n(c(SCC(=O)Nc2ccc3CCc4cccc2c34)n1)-c1ccccc1
: