Target
Procathepsin L
Ligand
BDBM53985
Substrate
Meas. Tech.
Counterscreen for inhibitors of M1 and M17 aminopeptidases: QFRET-based biochemical high throughput dose response assay for inhibitors of the Cathepsin L proteinase (CTSL1).
IC50
43106±n/a nM
Citation
 PubChem, PC Counterscreen for inhibitors of M1 and M17 aminopeptidases: QFRET-based biochemical high throughput dose response assay for inhibitors of the Cathepsin L proteinase (CTSL1). PubChem Bioassay (2009)[AID] 
Target
Name:
Procathepsin L
Synonyms:
CATL1_HUMAN CTSL CTSL1 Cathepsin L Cathepsin L1 heavy chain MEP cathepsin L preproprotein
Type:
Enzyme
Mol. Mass.:
37557.19
Organism:
Homo sapiens (Human)
Description:
Purchased from Calbiochem (San Diego, CA).
Residue:
333
  
Inhibitor
Name:
BDBM53985
Synonyms:
MLS000687796 N-[(5Z)-4-oxidanylidene-5-(2-oxidanylidene-1H-indol-3-ylidene)-2-sulfanylidene-1,3-thiazolidin-3-yl]pyridine-3-carboxamide N-[(5Z)-4-oxo-5-(2-oxo-1H-indol-3-ylidene)-2-sulfanylidene-3-thiazolidinyl]-3-pyridinecarboxamide cid_5452340
Type:
Small organic molecule
Emp. Form.:
C17H10N4O3S2
Mol. Mass.:
382.416
SMILES:
O=C(NN1C(=S)S\C(C1=O)=C1/C(=O)Nc2ccccc12)c1cccnc1
: