Target
Procathepsin L
Ligand
BDBM54099
Substrate
Meas. Tech.
Counterscreen for inhibitors of M1 and M17 aminopeptidases: QFRET-based biochemical high throughput dose response assay for inhibitors of the Cathepsin L proteinase (CTSL1).
IC50
>59642±n/a nM
Citation
 PubChem, PC Counterscreen for inhibitors of M1 and M17 aminopeptidases: QFRET-based biochemical high throughput dose response assay for inhibitors of the Cathepsin L proteinase (CTSL1). PubChem Bioassay (2009)[AID] 
Target
Name:
Procathepsin L
Synonyms:
CATL1_HUMAN CTSL CTSL1 Cathepsin L Cathepsin L1 heavy chain MEP cathepsin L preproprotein
Type:
Enzyme
Mol. Mass.:
37557.19
Organism:
Homo sapiens (Human)
Description:
Purchased from Calbiochem (San Diego, CA).
Residue:
333
  
Inhibitor
Name:
BDBM54099
Synonyms:
5-(1-Acetyl-5-phenyl-pyrazolidin-3-ylidene)-1,3-dimethyl-pyrimidine-2,4,6-trione 5-(1-acetyl-5-phenyl-pyrazolidin-3-ylidene)-1,3-dimethyl-barbituric acid 5-(1-ethanoyl-5-phenyl-pyrazolidin-3-ylidene)-1,3-dimethyl-1,3-diazinane-2,4,6-trione SMR000439472 | cid_6236645
Type:
Small organic molecule
Emp. Form.:
C17H18N4O4
Mol. Mass.:
342.3492
SMILES:
CN1C(=O)C(C2=NN(C(C2)c2ccccc2)C(C)=O)C(=O)N(C)C1=O
: