Target
Procathepsin L
Ligand
BDBM54101
Substrate
Meas. Tech.
Counterscreen for inhibitors of M1 and M17 aminopeptidases: QFRET-based biochemical high throughput dose response assay for inhibitors of the Cathepsin L proteinase (CTSL1).
IC50
>59642±n/a nM
Citation
 PubChem, PC Counterscreen for inhibitors of M1 and M17 aminopeptidases: QFRET-based biochemical high throughput dose response assay for inhibitors of the Cathepsin L proteinase (CTSL1). PubChem Bioassay (2009)[AID] 
Target
Name:
Procathepsin L
Synonyms:
CATL1_HUMAN CTSL CTSL1 Cathepsin L Cathepsin L1 heavy chain MEP cathepsin L preproprotein
Type:
Enzyme
Mol. Mass.:
37557.19
Organism:
Homo sapiens (Human)
Description:
Purchased from Calbiochem (San Diego, CA).
Residue:
333
  
Inhibitor
Name:
BDBM54101
Synonyms:
2-[(5Z)-4-keto-5-[(E)-2-methyl-3-phenyl-prop-2-enylidene]-2-thioxo-thiazolidin-3-yl]-2-phenyl-acetic acid 2-[(5Z)-5-[(E)-2-methyl-3-phenylprop-2-enylidene]-4-oxo-2-sulfanylidene-1,3-thiazolidin-3-yl]-2-phenylacetic acid MLS000806965 cid_5342621 | {5-[(E)-2-Methyl-3-phenyl-prop-2-en-(Z)-ylidene]-4-oxo-2-thioxo-thiazolidin-3-yl}-phenyl-acetic acid
Type:
Small organic molecule
Emp. Form.:
C21H17NO3S2
Mol. Mass.:
395.495
SMILES:
C\C(\C=C1/SC(=S)N(C(C(O)=O)c2ccccc2)C1=O)=C/c1ccccc1
: