Target
Induced myeloid leukemia cell differentiation protein Mcl-1
Ligand
BDBM54963
Substrate
Meas. Tech.
Fluorescence polarization-based biochemical high throughput dose response assay for inhibitors of myeloid cell leukemia sequence 1 (MCL1) interactions with BIM-BH3 peptide.
IC50
>108803±n/a nM
Citation
 PubChem, PC Fluorescence polarization-based biochemical high throughput dose response assay for inhibitors of myeloid cell leukemia sequence 1 (MCL1) interactions with BIM-BH3 peptide. PubChem Bioassay (2009)[AID] 
Target
Name:
Induced myeloid leukemia cell differentiation protein Mcl-1
Synonyms:
BCL2L3 Bcl-2-like protein 3 (Mcl-1) Bcl2-L-3 MCL1 Mcl-1 Myeloid cell leukemia sequence 1 (BCL2-related) | mcl1/EAT
Type:
Membrane; Single-pass membrane protein
Mol. Mass.:
37332.87
Organism:
Homo sapiens (Human)
Description:
Q07820
Residue:
350
  
Inhibitor
Name:
BDBM54963
Synonyms:
6-[4-(2-furoyl)piperazino]-8-(2-furyl)-3,3-dimethyl-1,4-dihydrothiopyrano[3,4-c]pyridine-5-carbonitrile 8-(2-furanyl)-6-[4-[2-furanyl(oxo)methyl]-1-piperazinyl]-3,3-dimethyl-1,4-dihydrothiopyrano[3,4-c]pyridine-5-carbonitrile MLS000071241 cid_658547
Type:
Small organic molecule
Emp. Form.:
C24H24N4O3S
Mol. Mass.:
448.537
SMILES:
CC1(C)Cc2c(CS1)c(nc(N1CCN(CC1)C(=O)c1ccco1)c2C#N)-c1ccco1
: