Target
Induced myeloid leukemia cell differentiation protein Mcl-1
Ligand
BDBM50303406
Substrate
Meas. Tech.
Fluorescence polarization-based biochemical high throughput dose response assay for inhibitors of myeloid cell leukemia sequence 1 (MCL1) interactions with BIM-BH3 peptide.
IC50
8582±n/a nM
Citation
 PubChem, PC Fluorescence polarization-based biochemical high throughput dose response assay for inhibitors of myeloid cell leukemia sequence 1 (MCL1) interactions with BIM-BH3 peptide. PubChem Bioassay (2009)[AID] 
Target
Name:
Induced myeloid leukemia cell differentiation protein Mcl-1
Synonyms:
BCL2L3 Bcl-2-like protein 3 (Mcl-1) Bcl2-L-3 MCL1 Mcl-1 Myeloid cell leukemia sequence 1 (BCL2-related) | mcl1/EAT
Type:
Membrane; Single-pass membrane protein
Mol. Mass.:
37332.87
Organism:
Homo sapiens (Human)
Description:
Q07820
Residue:
350
  
Inhibitor
Name:
BDBM50303406
Synonyms:
2-(2-(4-methyl-4H-1,2,4-triazol-3-ylthio)acetamido)-5,6-dihydro-4H-cyclopenta[b]thiophene-3-carboxamide cid_2514971
Type:
Small organic molecule
Emp. Form.:
C13H15N5O2S2
Mol. Mass.:
337.421
SMILES:
Cn1cnnc1SCC(=O)Nc1sc2CCCc2c1C(N)=O
: