Target
Induced myeloid leukemia cell differentiation protein Mcl-1
Ligand
BDBM61868
Substrate
Meas. Tech.
Fluorescence polarization-based biochemical high throughput dose response assay for inhibitors of myeloid cell leukemia sequence 1 (MCL1) interactions with BIM-BH3 peptide.
IC50
14099±n/a nM
Citation
 PubChem, PC Fluorescence polarization-based biochemical high throughput dose response assay for inhibitors of myeloid cell leukemia sequence 1 (MCL1) interactions with BIM-BH3 peptide. PubChem Bioassay (2009)[AID] 
Target
Name:
Induced myeloid leukemia cell differentiation protein Mcl-1
Synonyms:
BCL2L3 Bcl-2-like protein 3 (Mcl-1) Bcl2-L-3 MCL1 Mcl-1 Myeloid cell leukemia sequence 1 (BCL2-related) | mcl1/EAT
Type:
Membrane; Single-pass membrane protein
Mol. Mass.:
37332.87
Organism:
Homo sapiens (Human)
Description:
Q07820
Residue:
350
  
Inhibitor
Name:
BDBM61868
Synonyms:
5-[(3-carbazol-9-ylpropanoylhydrazinylidene)methyl]-4-(4-methylpyridin-1-ium-1-yl)-1,3-thiazol-2-olate 5-[[[3-(9-carbazolyl)-1-oxopropyl]hydrazinylidene]methyl]-4-(4-methyl-1-pyridin-1-iumyl)-2-thiazololate SMR000427303 | cid_1963735
Type:
Small organic molecule
Emp. Form.:
C25H21N5O2S
Mol. Mass.:
455.532
SMILES:
Cc1cc[n+](cc1)-c1[n-]c(=O)sc1\C=N\NC(=O)CCn1c2ccccc2c2ccccc12
: