Target
Bcl-2-like protein 1
Ligand
BDBM40631
Substrate
Meas. Tech.
Counterscreen for inhibitors of MCL1: fluorescence polarization-based biochemical high throughput dose response assay for inhibitors of BCL2-related protein, long isoform (BCLXL).
IC50
108803±n/a nM
Citation
 PubChem, PC Counterscreen for inhibitors of MCL1: fluorescence polarization-based biochemical high throughput dose response assay for inhibitors of BCL2-related protein, long isoform (BCLXL). PubChem Bioassay (2009)[AID] 
Target
Name:
Bcl-2-like protein 1
Synonyms:
Anti-apoptotic Bcl-2 protein Apoptosis regulator Bcl-X BCL2-like 1 isoform 1 BCL2L1 Bcl-2-like protein 1 (Bcl-XL) Bcl-xL/Bcl-2-binding component 3 Bcl2-antagonist of cell death (BAD)
Type:
Mitochondrion membrane; Single-pass membrane protein
Mol. Mass.:
26039.60
Organism:
Homo sapiens (Human)
Description:
Residue:
233
  
Inhibitor
Name:
BDBM40631
Synonyms:
2-(5,6-dihydro-4H-cyclopent[d]isoxazole-3-carbonylamino)benzoic acid methyl ester MLS000087339 cid_3240336 methyl 2-(5,6-dihydro-4H-cyclopenta[d][1,2]oxazole-3-carbonylamino)benzoate | methyl 2-[(5,6-dihydro-4H-cyclopenta[d]isoxazol-3-ylcarbonyl)amino]benzoate
Type:
Small organic molecule
Emp. Form.:
C15H14N2O4
Mol. Mass.:
286.2827
SMILES:
COC(=O)c1ccccc1NC(=O)c1noc2CCCc12
: