Target
Bcl-2-like protein 1
Ligand
BDBM31765
Substrate
Meas. Tech.
Counterscreen for inhibitors of MCL1: fluorescence polarization-based biochemical high throughput dose response assay for inhibitors of BCL2-related protein, long isoform (BCLXL).
IC50
53204±n/a nM
Citation
 PubChem, PC Counterscreen for inhibitors of MCL1: fluorescence polarization-based biochemical high throughput dose response assay for inhibitors of BCL2-related protein, long isoform (BCLXL). PubChem Bioassay (2009)[AID] 
Target
Name:
Bcl-2-like protein 1
Synonyms:
Anti-apoptotic Bcl-2 protein Apoptosis regulator Bcl-X BCL2-like 1 isoform 1 BCL2L1 Bcl-2-like protein 1 (Bcl-XL) Bcl-xL/Bcl-2-binding component 3 Bcl2-antagonist of cell death (BAD)
Type:
Mitochondrion membrane; Single-pass membrane protein
Mol. Mass.:
26039.60
Organism:
Homo sapiens (Human)
Description:
Residue:
233
  
Inhibitor
Name:
BDBM31765
Synonyms:
MLS-0024020.0001 N-(5-methyl-1,2-oxazol-3-yl)-2-thiophen-2-ylacetamide N-(5-methylisoxazol-3-yl)-2-(2-thienyl)acetamide | cid_717599
Type:
Small organic molecule
Emp. Form.:
C10H10N2O2S
Mol. Mass.:
222.264
SMILES:
Cc1cc(NC(=O)Cc2cccs2)no1
: