Target
Bcl-2-like protein 1
Ligand
BDBM50447
Substrate
Meas. Tech.
Counterscreen for inhibitors of MCL1: fluorescence polarization-based biochemical high throughput dose response assay for inhibitors of BCL2-related protein, long isoform (BCLXL).
IC50
108803±n/a nM
Citation
 PubChem, PC Counterscreen for inhibitors of MCL1: fluorescence polarization-based biochemical high throughput dose response assay for inhibitors of BCL2-related protein, long isoform (BCLXL). PubChem Bioassay (2009)[AID] 
Target
Name:
Bcl-2-like protein 1
Synonyms:
Anti-apoptotic Bcl-2 protein Apoptosis regulator Bcl-X BCL2-like 1 isoform 1 BCL2L1 Bcl-2-like protein 1 (Bcl-XL) Bcl-xL/Bcl-2-binding component 3 Bcl2-antagonist of cell death (BAD)
Type:
Mitochondrion membrane; Single-pass membrane protein
Mol. Mass.:
26039.60
Organism:
Homo sapiens (Human)
Description:
Residue:
233
  
Inhibitor
Name:
BDBM50447
Synonyms:
2-(4-bromoanilino)-6-nitro-1,3-benzothiazin-4-one 2-[(E)-4-Bromo-phenylimino]-6-nitro-2H-benzo[e][1,3]thiazin-4-ol SMR000217709 | cid_1420246
Type:
Small organic molecule
Emp. Form.:
C14H8BrN3O3S
Mol. Mass.:
378.201
SMILES:
[O-][N+](=O)c1ccc2s\c(=[NH+]\c3ccc(Br)cc3)[n-]c(=O)c2c1
: