Target
Bcl-2-like protein 1
Ligand
BDBM52965
Substrate
Meas. Tech.
Counterscreen for inhibitors of MCL1: fluorescence polarization-based biochemical high throughput dose response assay for inhibitors of BCL2-related protein, long isoform (BCLXL).
IC50
27252±n/a nM
Citation
 PubChem, PC Counterscreen for inhibitors of MCL1: fluorescence polarization-based biochemical high throughput dose response assay for inhibitors of BCL2-related protein, long isoform (BCLXL). PubChem Bioassay (2009)[AID] 
Target
Name:
Bcl-2-like protein 1
Synonyms:
Anti-apoptotic Bcl-2 protein Apoptosis regulator Bcl-X BCL2-like 1 isoform 1 BCL2L1 Bcl-2-like protein 1 (Bcl-XL) Bcl-xL/Bcl-2-binding component 3 Bcl2-antagonist of cell death (BAD)
Type:
Mitochondrion membrane; Single-pass membrane protein
Mol. Mass.:
26039.60
Organism:
Homo sapiens (Human)
Description:
Residue:
233
  
Inhibitor
Name:
BDBM52965
Synonyms:
1-O-methyl 4-O-(7-methyl-6,8-dioxo-3-thiophen-3-ylisochromen-7-yl) butanedioate MLS000438829 SMR000452585 cid_16759464 | succinic acid O4-[6,8-diketo-7-methyl-3-(3-thienyl)isochromen-7-yl] ester O1-methyl ester
Type:
Small organic molecule
Emp. Form.:
C19H16O7S
Mol. Mass.:
388.391
SMILES:
COC(=O)CCC(=O)OC1(C)C(=O)C=C2C=C(OC=C2C1=O)c1ccsc1
: