Target
Bcl-2-like protein 1
Ligand
BDBM61886
Substrate
Meas. Tech.
Counterscreen for inhibitors of MCL1: fluorescence polarization-based biochemical high throughput dose response assay for inhibitors of BCL2-related protein, long isoform (BCLXL).
IC50
108803±n/a nM
Citation
 PubChem, PC Counterscreen for inhibitors of MCL1: fluorescence polarization-based biochemical high throughput dose response assay for inhibitors of BCL2-related protein, long isoform (BCLXL). PubChem Bioassay (2009)[AID] 
Target
Name:
Bcl-2-like protein 1
Synonyms:
Anti-apoptotic Bcl-2 protein Apoptosis regulator Bcl-X BCL2-like 1 isoform 1 BCL2L1 Bcl-2-like protein 1 (Bcl-XL) Bcl-xL/Bcl-2-binding component 3 Bcl2-antagonist of cell death (BAD)
Type:
Mitochondrion membrane; Single-pass membrane protein
Mol. Mass.:
26039.60
Organism:
Homo sapiens (Human)
Description:
Residue:
233
  
Inhibitor
Name:
BDBM61886
Synonyms:
2-fluoranyl-N'-(3-pyrrol-1-ylphenyl)carbonyl-benzohydrazide 2-fluoro-N'-[oxo-[3-(1-pyrrolyl)phenyl]methyl]benzohydrazide SMR000708835 | cid_24979922
Type:
Small organic molecule
Emp. Form.:
C18H14FN3O2
Mol. Mass.:
323.3211
SMILES:
Fc1ccccc1C(=O)NNC(=O)c1cccc(c1)-n1cccc1
: