Target
Bcl-2-like protein 1
Ligand
BDBM55007
Substrate
Meas. Tech.
Counterscreen for inhibitors of MCL1: fluorescence polarization-based biochemical high throughput dose response assay for inhibitors of BCL2-related protein, long isoform (BCLXL).
IC50
108803±n/a nM
Citation
 PubChem, PC Counterscreen for inhibitors of MCL1: fluorescence polarization-based biochemical high throughput dose response assay for inhibitors of BCL2-related protein, long isoform (BCLXL). PubChem Bioassay (2009)[AID] 
Target
Name:
Bcl-2-like protein 1
Synonyms:
Anti-apoptotic Bcl-2 protein Apoptosis regulator Bcl-X BCL2-like 1 isoform 1 BCL2L1 Bcl-2-like protein 1 (Bcl-XL) Bcl-xL/Bcl-2-binding component 3 Bcl2-antagonist of cell death (BAD)
Type:
Mitochondrion membrane; Single-pass membrane protein
Mol. Mass.:
26039.60
Organism:
Homo sapiens (Human)
Description:
Residue:
233
  
Inhibitor
Name:
BDBM55007
Synonyms:
MLS001081306 N-[2-[(4-methoxyphenyl)amino]-2-oxidanylidene-ethyl]-N-methyl-5,6-dihydro-4H-cyclopenta[b]thiophene-2-carboxamide SMR000715453 | cid_9426403
Type:
Small organic molecule
Emp. Form.:
C18H20N2O3S
Mol. Mass.:
344.428
SMILES:
COc1ccc(NC(=O)CN(C)C(=O)c2cc3CCCc3s2)cc1
: