Target
Neuropeptide Y receptor type 2
Ligand
BDBM61787
Substrate
Meas. Tech.
Fluorescence-based counterscreen for agonists of NPY-Y1: cell-based high-throughput dose response assay for agonists of NPY-Y2.
EC50
35430±n/a nM
Citation
 PubChem, PC Fluorescence-based counterscreen for agonists of NPY-Y1: cell-based high-throughput dose response assay for agonists of NPY-Y2. PubChem Bioassay (2009)[AID] 
Target
Name:
Neuropeptide Y receptor type 2
Synonyms:
NPY-Y2 NPY2-R NPY2R_HUMAN Y2 receptor | neuropeptide Y receptor Y2
Type:
Enzyme Catalytic Domain
Mol. Mass.:
42734.65
Organism:
Homo sapiens (Human)
Description:
NPY-Y2 NPY2R HUMAN::P49146
Residue:
381
  
Inhibitor
Name:
BDBM61787
Synonyms:
1-(2-methylphenoxy)-3-[4-[3-(2-methylphenoxy)-2-oxidanyl-propyl]piperazin-1-yl]propan-2-ol 1-[4-[2-hydroxy-3-(2-methylphenoxy)propyl]piperazin-1-yl]-3-(2-methylphenoxy)propan-2-ol MLS000856374 cid_2879592
Type:
Small organic molecule
Emp. Form.:
C24H34N2O4
Mol. Mass.:
414.5378
SMILES:
Cc1ccccc1OCC(O)CN1CCN(CC(O)COc2ccccc2C)CC1
: