Target
Neuropeptide Y receptor type 2
Ligand
BDBM61791
Substrate
Meas. Tech.
Fluorescence-based counterscreen for agonists of NPY-Y1: cell-based high-throughput dose response assay for agonists of NPY-Y2.
EC50
35430±n/a nM
Citation
 PubChem, PC Fluorescence-based counterscreen for agonists of NPY-Y1: cell-based high-throughput dose response assay for agonists of NPY-Y2. PubChem Bioassay (2009)[AID] 
Target
Name:
Neuropeptide Y receptor type 2
Synonyms:
NPY-Y2 NPY2-R NPY2R_HUMAN Y2 receptor | neuropeptide Y receptor Y2
Type:
Enzyme Catalytic Domain
Mol. Mass.:
42734.65
Organism:
Homo sapiens (Human)
Description:
NPY-Y2 NPY2R HUMAN::P49146
Residue:
381
  
Inhibitor
Name:
BDBM61791
Synonyms:
1-(4-chloranylphenoxy)-3-(2,3-dihydro-1H-inden-2-ylamino)propan-2-ol 1-(4-chlorophenoxy)-3-(2,3-dihydro-1H-inden-2-ylamino)propan-2-ol MLS000830157 cid_2809885
Type:
Small organic molecule
Emp. Form.:
C18H20ClNO2
Mol. Mass.:
317.81
SMILES:
OC(CNC1Cc2ccccc2C1)COc1ccc(Cl)cc1
: