Target
Phosphotransferase
Ligand
BDBM61908
Substrate
Meas. Tech.
Confirmation assay for inhibitors of Trypanosoma brucei hexokinase 1-Analogue-first series
IC50
25000±n/a nM
Citation
 PubChem, PC Confirmation assay for inhibitors of Trypanosoma brucei hexokinase 1-Analogue-first series PubChem Bioassay (2010)[AID] 
Target
Name:
Phosphotransferase
Synonyms:
hexokinase
Type:
Enzyme Catalytic Domain
Mol. Mass.:
51160.00
Organism:
Trypanosoma brucei
Description:
gi_70832125
Residue:
471
  
Inhibitor
Name:
BDBM61908
Synonyms:
2-methyl-1,2-benzothiazol-3-one acs.jmedchem.1c00409_ST.167 | cid_351236
Type:
Small organic molecule
Emp. Form.:
C8H7NOS
Mol. Mass.:
165.212
SMILES:
Cn1sc2ccccc2c1=O
: