Target
Phosphotransferase
Ligand
BDBM61916
Substrate
Meas. Tech.
Confirmation assay for inhibitors of Trypanosoma brucei hexokinase 1-Analogue-first series
IC50
5350±n/a nM
Citation
 PubChem, PC Confirmation assay for inhibitors of Trypanosoma brucei hexokinase 1-Analogue-first series PubChem Bioassay (2010)[AID] 
Target
Name:
Phosphotransferase
Synonyms:
hexokinase
Type:
Enzyme Catalytic Domain
Mol. Mass.:
51160.00
Organism:
Trypanosoma brucei
Description:
gi_70832125
Residue:
471
  
Inhibitor
Name:
BDBM61916
Synonyms:
2-(4-methoxyphenyl)-1,2-benzothiazol-3-one KUC103867N | cid_11054313
Type:
Small organic molecule
Emp. Form.:
C14H11NO2S
Mol. Mass.:
257.308
SMILES:
COc1ccc(cc1)-n1sc2ccccc2c1=O
: