Target
Phosphotransferase
Ligand
BDBM61932
Substrate
Meas. Tech.
Confirmation assay for inhibitors of Trypanosoma brucei hexokinase 1-Analogue-first series
IC50
5180±n/a nM
Citation
 PubChem, PC Confirmation assay for inhibitors of Trypanosoma brucei hexokinase 1-Analogue-first series PubChem Bioassay (2010)[AID] 
Target
Name:
Phosphotransferase
Synonyms:
hexokinase
Type:
Enzyme Catalytic Domain
Mol. Mass.:
51160.00
Organism:
Trypanosoma brucei
Description:
gi_70832125
Residue:
471
  
Inhibitor
Name:
BDBM61932
Synonyms:
2-(3-keto-1,2-benzothiazol-2-yl)-N-(p-tolyl)acetamide KUC104219N N-(4-methylphenyl)-2-(3-oxo-1,2-benzothiazol-2-yl)acetamide | cid_44623834
Type:
Small organic molecule
Emp. Form.:
C16H14N2O2S
Mol. Mass.:
298.36
SMILES:
Cc1ccc(NC(=O)Cn2sc3ccccc3c2=O)cc1
: