Target
Phosphotransferase
Ligand
BDBM61950
Substrate
Meas. Tech.
Confirmation assay for inhibitors of Trypanosoma brucei hexokinase 1-Analogue-first series
IC50
4782.333333±n/a nM
Citation
 PubChem, PC Confirmation assay for inhibitors of Trypanosoma brucei hexokinase 1-Analogue-first series PubChem Bioassay (2010)[AID] 
Target
Name:
Phosphotransferase
Synonyms:
hexokinase
Type:
Enzyme Catalytic Domain
Mol. Mass.:
51160.00
Organism:
Trypanosoma brucei
Description:
gi_70832125
Residue:
471
  
Inhibitor
Name:
BDBM61950
Synonyms:
KSC-13-8-P2 N-(3-fluorophenyl)-2-(3-keto-1,2-benzothiazol-2-yl)acetamide N-(3-fluorophenyl)-2-(3-oxo-1,2-benzothiazol-2-yl)acetamide | cid_45105115
Type:
Small organic molecule
Emp. Form.:
C15H11FN2O2S
Mol. Mass.:
302.323
SMILES:
Fc1cccc(NC(=O)Cn2sc3ccccc3c2=O)c1
: