Target
Phosphotransferase
Ligand
BDBM61965
Substrate
Meas. Tech.
Confirmation assay for inhibitors of Trypanosoma brucei hexokinase 1-Analogue-first series
IC50
5799.333333±n/a nM
Citation
 PubChem, PC Confirmation assay for inhibitors of Trypanosoma brucei hexokinase 1-Analogue-first series PubChem Bioassay (2010)[AID] 
Target
Name:
Phosphotransferase
Synonyms:
hexokinase
Type:
Enzyme Catalytic Domain
Mol. Mass.:
51160.00
Organism:
Trypanosoma brucei
Description:
gi_70832125
Residue:
471
  
Inhibitor
Name:
BDBM61965
Synonyms:
KSC-09-149A N-(2-fluorophenyl)-2-(3-keto-1,2-benzothiazol-2-yl)acetamide N-(2-fluorophenyl)-2-(3-oxidanylidene-1,2-benzothiazol-2-yl)ethanamide cid_45479198
Type:
Small organic molecule
Emp. Form.:
C15H11FN2O2S
Mol. Mass.:
302.323
SMILES:
Fc1ccccc1NC(=O)Cn1sc2ccccc2c1=O
: