Target
Phosphotransferase
Ligand
BDBM61991
Substrate
Meas. Tech.
Confirmation assay for inhibitors of Trypanosoma brucei hexokinase 1-Analogue-first series
IC50
25000±n/a nM
Citation
 PubChem, PC Confirmation assay for inhibitors of Trypanosoma brucei hexokinase 1-Analogue-first series PubChem Bioassay (2010)[AID] 
Target
Name:
Phosphotransferase
Synonyms:
hexokinase
Type:
Enzyme Catalytic Domain
Mol. Mass.:
51160.00
Organism:
Trypanosoma brucei
Description:
gi_70832125
Residue:
471
  
Inhibitor
Name:
BDBM61991
Synonyms:
KSC-6-267 N-(5-chloranyl-2-cyano-phenyl)-4-methoxy-benzamide N-(5-chloro-2-cyanophenyl)-4-methoxybenzamide | cid_46173041
Type:
Small organic molecule
Emp. Form.:
C15H11ClN2O2
Mol. Mass.:
286.713
SMILES:
COc1ccc(cc1)C(=O)Nc1cc(Cl)ccc1C#N
: