Target
Phosphotransferase
Ligand
BDBM62000
Substrate
Meas. Tech.
Confirmation assay for inhibitors of Trypanosoma brucei hexokinase 1-Analogue-first series
IC50
25000±n/a nM
Citation
 PubChem, PC Confirmation assay for inhibitors of Trypanosoma brucei hexokinase 1-Analogue-first series PubChem Bioassay (2010)[AID] 
Target
Name:
Phosphotransferase
Synonyms:
hexokinase
Type:
Enzyme Catalytic Domain
Mol. Mass.:
51160.00
Organism:
Trypanosoma brucei
Description:
gi_70832125
Residue:
471
  
Inhibitor
Name:
BDBM62000
Synonyms:
4-chloranyl-2-[(4-methoxyphenyl)sulfonylamino]benzoic acid KSC-6-278 cid_45464172
Type:
Small organic molecule
Emp. Form.:
C14H12ClNO5S
Mol. Mass.:
341.767
SMILES:
COc1ccc(cc1)S(=O)(=O)Nc1cc(Cl)ccc1C(O)=O
: