Target
Phosphotransferase
Ligand
BDBM62010
Substrate
Meas. Tech.
Confirmation assay for inhibitors of Trypanosoma brucei hexokinase 1-Analogue-first series
IC50
25000±n/a nM
Citation
 PubChem, PC Confirmation assay for inhibitors of Trypanosoma brucei hexokinase 1-Analogue-first series PubChem Bioassay (2010)[AID] 
Target
Name:
Phosphotransferase
Synonyms:
hexokinase
Type:
Enzyme Catalytic Domain
Mol. Mass.:
51160.00
Organism:
Trypanosoma brucei
Description:
gi_70832125
Residue:
471
  
Inhibitor
Name:
BDBM62010
Synonyms:
2-(p-anisoylamino)-4-phenyl-benzoic acid 2-[(4-methoxyphenyl)carbonylamino]-4-phenyl-benzoic acid KSC-09-184 cid_46245545
Type:
Small organic molecule
Emp. Form.:
C21H17NO4
Mol. Mass.:
347.364
SMILES:
COc1ccc(cc1)C(=O)Nc1cc(ccc1C(O)=O)-c1ccccc1
: