Target
Neuropeptides B/W receptor type 1
Ligand
BDBM42446
Substrate
Meas. Tech.
Fluorescence-based dose response cell-based high throughput screening assay to identify antagonists of the G-protein coupled receptor 7 (GPR7).
IC50
43807±n/a nM
Citation
 PubChem, PC Fluorescence-based dose response cell-based high throughput screening assay to identify antagonists of the G-protein coupled receptor 7 (GPR7). PubChem Bioassay (2010)[AID] 
Target
Name:
Neuropeptides B/W receptor type 1
Synonyms:
GPR7 NPBWR1 | neuropeptides B/W receptor 1
Type:
Enzyme Catalytic Domain
Mol. Mass.:
36111.82
Organism:
Homo sapiens (Human)
Description:
gi_119607128
Residue:
328
  
Inhibitor
Name:
BDBM42446
Synonyms:
1-{[3-(4-methoxyphenyl)-1,2,4-oxadiazol-5-yl]methyl}-2-(1-methyl-1H-imidazol-2-yl)piperidine 3-(4-methoxyphenyl)-5-[[2-(1-methylimidazol-2-yl)piperidin-1-yl]methyl]-1,2,4-oxadiazole MLS000732204 cid_16190203
Type:
Small organic molecule
Emp. Form.:
C19H23N5O2
Mol. Mass.:
353.4182
SMILES:
COc1ccc(cc1)-c1noc(CN2CCCCC2c2nccn2C)n1
: