Target
Neuropeptides B/W receptor type 1
Ligand
BDBM62112
Substrate
Meas. Tech.
Fluorescence-based dose response cell-based high throughput screening assay to identify antagonists of the G-protein coupled receptor 7 (GPR7).
IC50
2884±n/a nM
Citation
 PubChem, PC Fluorescence-based dose response cell-based high throughput screening assay to identify antagonists of the G-protein coupled receptor 7 (GPR7). PubChem Bioassay (2010)[AID] 
Target
Name:
Neuropeptides B/W receptor type 1
Synonyms:
GPR7 NPBWR1 | neuropeptides B/W receptor 1
Type:
Enzyme Catalytic Domain
Mol. Mass.:
36111.82
Organism:
Homo sapiens (Human)
Description:
gi_119607128
Residue:
328
  
Inhibitor
Name:
BDBM62112
Synonyms:
1-(4-chloranyl-3-nitro-phenyl)sulfonylazepane 1-(4-chloro-3-nitrophenyl)sulfonylazepane SMR000272996 | cid_3114950
Type:
Small organic molecule
Emp. Form.:
C12H15ClN2O4S
Mol. Mass.:
318.777
SMILES:
[O-][N+](=O)c1cc(ccc1Cl)S(=O)(=O)N1CCCCCC1
: