Target
Neuropeptides B/W receptor type 1
Ligand
BDBM62166
Substrate
Meas. Tech.
Fluorescence-based dose response cell-based high throughput screening assay to identify antagonists of the G-protein coupled receptor 7 (GPR7).
IC50
7864±n/a nM
Citation
 PubChem, PC Fluorescence-based dose response cell-based high throughput screening assay to identify antagonists of the G-protein coupled receptor 7 (GPR7). PubChem Bioassay (2010)[AID] 
Target
Name:
Neuropeptides B/W receptor type 1
Synonyms:
GPR7 NPBWR1 | neuropeptides B/W receptor 1
Type:
Enzyme Catalytic Domain
Mol. Mass.:
36111.82
Organism:
Homo sapiens (Human)
Description:
gi_119607128
Residue:
328
  
Inhibitor
Name:
BDBM62166
Synonyms:
(5S)-1-[(4-tert-butylcyclohexyl)methyl]-N,N-dimethyl-5-(phenylmethyl)-4,5-dihydroimidazol-2-amine MLS001368595 [(5S)-5-benzyl-1-[(4-tert-butylcyclohexyl)methyl]-2-imidazolin-2-yl]-dimethyl-amine | cid_24856242
Type:
Small organic molecule
Emp. Form.:
C23H37N3
Mol. Mass.:
355.56
SMILES:
CN(C)C1=NC[C@H](Cc2ccccc2)N1CC1CCC(CC1)C(C)(C)C
: