Target
Bromodomain-containing protein 4 [75-147]
Ligand
BDBM249274
Substrate
Meas. Tech.
HTRF Assay
IC50
337±n/a nM
Citation
 Aktoudianakis, EChin, GCorkey, BKDu, JElbel, KJiang, RHKobayashi, TLee, RMartinez, RMetobo, SEMish, MMunoz, MShevick, SSperandio, DYang, HZablocki, J Benzimidazole derivatives as bromodomain inhibitors US Patent  US10017501 Publication Date 7/10/2018 
Target
Name:
Bromodomain-containing protein 4 [75-147]
Synonyms:
BRD4 Bromo domain 1 Bromodomain-containing protein 4 (BRD4) Bromo 1 Bromodomain-containing protein 4 (BRD4)(Bromo 1) Bromodomain-containing protein 4 Bromodomain 1 (BRD4-1) HUNK1
Type:
Mol. Mass.:
8856.55
Organism:
Homo sapiens (Human)
Description:
BD1 (75-147 aa) of O60885
Residue:
73
  
Inhibitor
Name:
BDBM249274
Synonyms:
US10017501, Compound 1020-4 | US9458145, 1020-4
Type:
Small organic molecule
Emp. Form.:
C18H22N4O3S2
Mol. Mass.:
406.522
SMILES:
CSc1nc2c(cc(cc2[nH]1)-c1c(C)noc1C)S(=O)(=O)NC1CCCC1
: