Target
Bromodomain-containing protein 4 [75-147]
Ligand
BDBM249296
Substrate
Meas. Tech.
HTRF Assay
IC50
276±n/a nM
Citation
 Aktoudianakis, EChin, GCorkey, BKDu, JElbel, KJiang, RHKobayashi, TLee, RMartinez, RMetobo, SEMish, MMunoz, MShevick, SSperandio, DYang, HZablocki, J Benzimidazole derivatives as bromodomain inhibitors US Patent  US10017501 Publication Date 7/10/2018 
Target
Name:
Bromodomain-containing protein 4 [75-147]
Synonyms:
BRD4 Bromo domain 1 Bromodomain-containing protein 4 (BRD4) Bromo 1 Bromodomain-containing protein 4 (BRD4)(Bromo 1) Bromodomain-containing protein 4 Bromodomain 1 (BRD4-1) HUNK1
Type:
Mol. Mass.:
8856.55
Organism:
Homo sapiens (Human)
Description:
BD1 (75-147 aa) of O60885
Residue:
73
  
Inhibitor
Name:
BDBM249296
Synonyms:
US10017501, Compound 1020-96 | US9458145, 1020-96
Type:
Small organic molecule
Emp. Form.:
C17H18N6O
Mol. Mass.:
322.3644
SMILES:
Cc1n[nH]c(C)c1-c1cc(cc2nc(N)[nH]c12)-c1c(C)noc1C
: