Target
Fibroblast growth factor receptor 4
Ligand
BDBM102167
Substrate
Meas. Tech.
FGFR-4 wild type assay at Km
pH
7.5±n/a
Temperature
298.15±n/a K
IC50
<10.00±n/a nM
Comments
extracted
Citation
 Bifulco, Jr., NDiPietro, LVMiduturu, CV Inhibitors of the fibroblast growth factor receptor US Patent  US9695165 Publication Date 7/4/2017 
Target
Name:
Fibroblast growth factor receptor 4
Synonyms:
CD_antigen: CD334 FGFR4 FGFR4 Fibroblast growth factor receptor JK2 TKF
Type:
Protein
Mol. Mass.:
87957.45
Organism:
Homo sapiens (Human)
Description:
P22455
Residue:
802
  
Inhibitor
Name:
BDBM102167
Synonyms:
US9695165, 10
Type:
Small organic molecule
Emp. Form.:
C28H25F2N3O4
Mol. Mass.:
505.5126
SMILES:
COc1cc(OC)c(F)c(c1)-c1cc2cnc(cc2n(C(C)C)c1=O)-c1cc(NC(=O)C=C)ccc1F
: