Target
Eukaryotic translation initiation factor 2-alpha kinase 3
Ligand
BDBM103503
Substrate
Meas. Tech.
Alpha Elisa Assay
IC50
55±n/a nM
Citation
 Bifulco, Jr., NDiPietro, LVMiduturu, CV Inhibitors of the fibroblast growth factor receptor US Patent  US9695165 Publication Date 7/4/2017 
Target
Name:
Eukaryotic translation initiation factor 2-alpha kinase 3
Synonyms:
E2AK3_HUMAN HsPEK PERK Pancreatic endoplasmic reticulum kinase (PERK)
Type:
Enzyme
Mol. Mass.:
125190.66
Organism:
Homo sapiens (Human)
Description:
Q9NZJ5
Residue:
1116
  
Inhibitor
Name:
BDBM103503
Synonyms:
US9695165, 27
Type:
Small organic molecule
Emp. Form.:
C28H25Cl2N3O4
Mol. Mass.:
538.422
SMILES:
CCn1c2cc(ncc2cc(-c2c(Cl)c(OC)cc(OC)c2Cl)c1=O)-c1cc(NC(=O)C=C)ccc1C
: