Target
Fibroblast growth factor receptor 4
Ligand
BDBM103610
Substrate
Meas. Tech.
FGFR-4 wild type assay at Km
pH
7.5±n/a
Temperature
298.15±n/a K
IC50
55±n/a nM
Comments
extracted
Citation
 Bifulco, Jr., NDiPietro, LVMiduturu, CV Inhibitors of the fibroblast growth factor receptor US Patent  US9695165 Publication Date 7/4/2017 
Target
Name:
Fibroblast growth factor receptor 4
Synonyms:
CD_antigen: CD334 FGFR4 FGFR4 Fibroblast growth factor receptor JK2 TKF
Type:
Protein
Mol. Mass.:
87957.45
Organism:
Homo sapiens (Human)
Description:
P22455
Residue:
802
  
Inhibitor
Name:
BDBM103610
Synonyms:
US9695165, 29
Type:
Small organic molecule
Emp. Form.:
C27H26Cl2N4O4
Mol. Mass.:
541.426
SMILES:
CCN1C(=O)N(Cc2cnc(cc12)-c1cc(NC(=O)C=C)ccc1C)c1c(Cl)c(OC)cc(OC)c1Cl
: