Target
Eukaryotic translation initiation factor 2-alpha kinase 3
Ligand
BDBM103857
Substrate
Meas. Tech.
Alpha Elisa Assay
IC50
<10.00±n/a nM
Citation
 Bifulco, Jr., NDiPietro, LVMiduturu, CV Inhibitors of the fibroblast growth factor receptor US Patent  US9695165 Publication Date 7/4/2017 
Target
Name:
Eukaryotic translation initiation factor 2-alpha kinase 3
Synonyms:
E2AK3_HUMAN HsPEK PERK Pancreatic endoplasmic reticulum kinase (PERK)
Type:
Enzyme
Mol. Mass.:
125190.66
Organism:
Homo sapiens (Human)
Description:
Q9NZJ5
Residue:
1116
  
Inhibitor
Name:
BDBM103857
Synonyms:
US9695165, 40
Type:
Small organic molecule
Emp. Form.:
C28H24Cl2FN3O4
Mol. Mass.:
556.412
SMILES:
COc1cc(OC)c(Cl)c(c1Cl)-c1cc2cnc(cc2n(C(C)C)c1=O)-c1cc(NC(=O)C=C)ccc1F
: