Target
Kappa-type opioid receptor
Ligand
BDBM62197
Substrate
Meas. Tech.
SAR analysis of small molecule antagonists of the kappa opioid receptor via a luminescent beta-arrestin assay
IC50
10000±n/a nM
Citation
 PubChem, PC SAR analysis of small molecule antagonists of the kappa opioid receptor via a luminescent beta-arrestin assay PubChem Bioassay (2010)[AID] 
Target
Name:
Kappa-type opioid receptor
Synonyms:
K-OR-1 Kappa-opioid receptor (KOR) Kappa-type opioid receptor (KOR) OPIATE Kappa OPRK1 kappa opioid receptor (KOR)
Type:
G Protein-Coupled Receptor (GPCR)
Mol. Mass.:
42648.76
Organism:
Homo sapiens (Human)
Description:
P41145
Residue:
380
  
Inhibitor
Name:
BDBM62197
Synonyms:
(phenylmethyl) N-[1-[(3-bromophenyl)carbamothioylamino]-2,2,2-tris(chloranyl)ethyl]carbamate N-[1-[(3-bromophenyl)thiocarbamoylamino]-2,2,2-trichloro-ethyl]carbamic acid benzyl ester benzyl N-[1-[(3-bromophenyl)carbamothioylamino]-2,2,2-trichloroethyl]carbamate | cid_3091269
Type:
Small organic molecule
Emp. Form.:
C17H15BrCl3N3O2S
Mol. Mass.:
511.648
SMILES:
ClC(Cl)(Cl)C(NC(=O)OCc1ccccc1)NC(=S)Nc1cccc(Br)c1
: