Target
Regulator of G-protein signaling 7
Ligand
BDBM62218
Substrate
Meas. Tech.
Dose response, multiplexed high-throughput screen for small molecule regulators of RGS family protein interactions, specifically RGS7-Galphao for SAR Compounds
EC50
30000±n/a nM
Citation
 PubChem, PC Dose response, multiplexed high-throughput screen for small molecule regulators of RGS family protein interactions, specifically RGS7-Galphao for SAR Compounds PubChem Bioassay (2010)[AID] 
Target
Name:
Regulator of G-protein signaling 7
Synonyms:
RGS7 | RGS7_HUMAN
Type:
Enzyme Catalytic Domain
Mol. Mass.:
57675.72
Organism:
Homo sapiens (Human)
Description:
P49802
Residue:
495
  
Inhibitor
Name:
BDBM62218
Synonyms:
2,4-dimethyl-6-[2-[3-methyl-4-(3-methylphenyl)-1-piperazinyl]-2-oxoethyl]-1,6-naphthyridin-5-one 2,4-dimethyl-6-[2-[3-methyl-4-(3-methylphenyl)piperazin-1-yl]-2-oxoethyl]-1,6-naphthyridin-5-one KUC103673N | cid_44473129
Type:
Small organic molecule
Emp. Form.:
C24H28N4O2
Mol. Mass.:
404.5047
SMILES:
CC1CN(CCN1c1cccc(C)c1)C(=O)Cn1ccc2nc(C)cc(C)c2c1=O
: