Target
Regulator of G-protein signaling 16
Ligand
BDBM62209
Substrate
Meas. Tech.
Dose response, multiplexed high-throughput screen for small molecule regulators of RGS family protein interactions, specifically RGS16-Galphao for SAR Compounds
EC50
30000±0 nM
Citation
 PubChem, PC Dose response, multiplexed high-throughput screen for small molecule regulators of RGS family protein interactions, specifically RGS16-Galphao for SAR Compounds PubChem Bioassay (2010)[AID] 
Target
Name:
Regulator of G-protein signaling 16
Synonyms:
RGS16 RGSR regulator of G-protein signalling 16
Type:
Enzyme Catalytic Domain
Mol. Mass.:
22748.87
Organism:
Homo sapiens (Human)
Description:
gi_156416009
Residue:
202
  
Inhibitor
Name:
BDBM62209
Synonyms:
UNM-0000305796 | cid_18559023
Type:
Small organic molecule
Emp. Form.:
C25H23N3O4S
Mol. Mass.:
461.533
SMILES:
Nc1c(sc2nc3\C(CCc3c(-c3ccco3)c12)=C/c1ccco1)C(=O)NCC1CCCO1
: