Target
Sphingosine 1-phosphate receptor 4
Ligand
BDBM62223
Substrate
Meas. Tech.
Late stage fluorescence dose response cell-based screening assay for antagonists of the Sphingosine 1-Phosphate Receptor 4 (S1P4)
IC50
39.27±n/a nM
Citation
 PubChem, PC Late stage fluorescence dose response cell-based screening assay for antagonists of the Sphingosine 1-Phosphate Receptor 4 (S1P4) PubChem Bioassay (2010)[AID] 
Target
Name:
Sphingosine 1-phosphate receptor 4
Synonyms:
EDG6 S1P receptor 4 S1P4 S1PR4_HUMAN Sphingosine 1-phosphate receptor Edg-6 sphingosine-1-phosphate 4 S1P4
Type:
G Protein-Coupled Receptor (GPCR)
Mol. Mass.:
41647.39
Organism:
Homo sapiens (Human)
Description:
Residue:
384
  
Inhibitor
Name:
BDBM62223
Synonyms:
5-(2,4-dichlorophenyl)-N-(2,6-dimethylphenyl)-2-furamide 5-(2,4-dichlorophenyl)-N-(2,6-dimethylphenyl)furan-2-carboxamide SR-01000669308-2 | cid_1363299
Type:
Small organic molecule
Emp. Form.:
C19H15Cl2NO2
Mol. Mass.:
360.234
SMILES:
Cc1cccc(C)c1NC(=O)c1ccc(o1)-c1ccc(Cl)cc1Cl
: