Target
Sphingosine 1-phosphate receptor 4
Ligand
BDBM43228
Substrate
Meas. Tech.
Late stage fluorescence dose response cell-based screening assay for antagonists of the Sphingosine 1-Phosphate Receptor 4 (S1P4)
IC50
3715±n/a nM
Citation
 PubChem, PC Late stage fluorescence dose response cell-based screening assay for antagonists of the Sphingosine 1-Phosphate Receptor 4 (S1P4) PubChem Bioassay (2010)[AID] 
Target
Name:
Sphingosine 1-phosphate receptor 4
Synonyms:
EDG6 S1P receptor 4 S1P4 S1PR4_HUMAN Sphingosine 1-phosphate receptor Edg-6 sphingosine-1-phosphate 4 S1P4
Type:
G Protein-Coupled Receptor (GPCR)
Mol. Mass.:
41647.39
Organism:
Homo sapiens (Human)
Description:
Residue:
384
  
Inhibitor
Name:
BDBM43228
Synonyms:
1,1,4,4-tetraketo-6-phenyl-N-(p-tolyl)-2,3-dihydro-1,4-dithiin-5-carboxamide N-(4-methylphenyl)-1,1,4,4-tetrakis(oxidanylidene)-6-phenyl-2,3-dihydro-1,4-dithiine-5-carboxamide N-(4-methylphenyl)-1,1,4,4-tetraoxo-6-phenyl-2,3-dihydro-1,4-dithiine-5-carboxamide cid_2330223
Type:
Small organic molecule
Emp. Form.:
C18H17NO5S2
Mol. Mass.:
391.461
SMILES:
Cc1ccc(NC(=O)C2=C(c3ccccc3)S(=O)(=O)CCS2(=O)=O)cc1
: