Target
Nucleotide-binding oligomerization domain-containing protein 1
Ligand
BDBM50312
Substrate
Meas. Tech.
SAR analysis of compounds that inhibit NOD1 revised
IC50
429±n/a nM
Citation
 PubChem, PC SAR analysis of compounds that inhibit NOD1 revised PubChem Bioassay (2010)[AID] 
Target
Name:
Nucleotide-binding oligomerization domain-containing protein 1
Synonyms:
CARD4 NOD1_HUMAN | nucleotide-binding oligomerization domain containing 1
Type:
Enzyme Catalytic Domain
Mol. Mass.:
107699.03
Organism:
Homo sapiens (Human)
Description:
gi_5174617
Residue:
953
  
Inhibitor
Name:
BDBM50312
Synonyms:
2-[(4,6-difluoro-1,3-benzothiazol-2-yl)amino]-1,3-benzothiazole-6-carboxylic acid methyl ester SMR000236235 methyl 2-[(4,6-difluoro-1,3-benzothiazol-2-yl)amino]-1,3-benzothiazole-6-carboxylate | methyl 2-[[4,6-bis(fluoranyl)-1,3-benzothiazol-2-yl]amino]-1,3-benzothiazole-6-carboxylate
Type:
Small organic molecule
Emp. Form.:
C16H9F2N3O2S2
Mol. Mass.:
377.388
SMILES:
COC(=O)c1ccc2nc(Nc3nc4c(F)cc(F)cc4s3)sc2c1
: