Target
Nucleotide-binding oligomerization domain-containing protein 2
Ligand
BDBM62329
Substrate
Meas. Tech.
SAR analysis of compounds that inhibit NOD2 revised
IC50
20000±n/a nM
Citation
 PubChem, PC SAR analysis of compounds that inhibit NOD2 revised PubChem Bioassay (2010)[AID] 
Target
Name:
Nucleotide-binding oligomerization domain-containing protein 2
Synonyms:
CARD15 IBD1 NOD2 Nucleotide-binding oligomerization domain-containing protein 2 | nucleotide-binding oligomerization domain containing 2
Type:
PROTEIN
Mol. Mass.:
115287.18
Organism:
Homo sapiens (Human)
Description:
ChEMBL_1454053
Residue:
1040
  
Inhibitor
Name:
BDBM62329
Synonyms:
2-(4-fluorobenzyl)-N-[1-(2-fluorophenyl)-4,5,6,7-tetrahydroindazol-4-yl]-5-methyl-pyrazole-3-carboxamide 2-[(4-fluorophenyl)methyl]-N-[1-(2-fluorophenyl)-4,5,6,7-tetrahydroindazol-4-yl]-5-methyl-pyrazole-3-carboxamide MLS-0425628.0001 | cid_44251473
Type:
Small organic molecule
Emp. Form.:
C25H23F2N5O
Mol. Mass.:
447.4798
SMILES:
Cc1cc(C(=O)NC2CCCc3c2cnn3-c2ccccc2F)n(Cc2ccc(F)cc2)n1
: