Target
Nucleotide-binding oligomerization domain-containing protein 2
Ligand
BDBM62358
Substrate
Meas. Tech.
SAR analysis of compounds that inhibit NOD2 revised
IC50
20000±n/a nM
Citation
 PubChem, PC SAR analysis of compounds that inhibit NOD2 revised PubChem Bioassay (2010)[AID] 
Target
Name:
Nucleotide-binding oligomerization domain-containing protein 2
Synonyms:
CARD15 IBD1 NOD2 Nucleotide-binding oligomerization domain-containing protein 2 | nucleotide-binding oligomerization domain containing 2
Type:
PROTEIN
Mol. Mass.:
115287.18
Organism:
Homo sapiens (Human)
Description:
ChEMBL_1454053
Residue:
1040
  
Inhibitor
Name:
BDBM62358
Synonyms:
2-[(2-keto-2-morpholino-acetyl)amino]-4,5,6,7-tetrahydrobenzothiophene-3-carboxylic acid 2-[(2-morpholin-4-yl-2-oxoacetyl)amino]-4,5,6,7-tetrahydro-1-benzothiophene-3-carboxylic acid MLS-0370153.0001 | cid_17585844
Type:
Small organic molecule
Emp. Form.:
C15H18N2O5S
Mol. Mass.:
338.379
SMILES:
OC(=O)c1c(NC(=O)C(=O)N2CCOCC2)sc2CCCCc12
: