Target
Nucleotide-binding oligomerization domain-containing protein 2
Ligand
BDBM54378
Substrate
Meas. Tech.
SAR analysis of compounds that inhibit NOD2 revised
IC50
20000±n/a nM
Citation
 PubChem, PC SAR analysis of compounds that inhibit NOD2 revised PubChem Bioassay (2010)[AID] 
Target
Name:
Nucleotide-binding oligomerization domain-containing protein 2
Synonyms:
CARD15 IBD1 NOD2 Nucleotide-binding oligomerization domain-containing protein 2 | nucleotide-binding oligomerization domain containing 2
Type:
PROTEIN
Mol. Mass.:
115287.18
Organism:
Homo sapiens (Human)
Description:
ChEMBL_1454053
Residue:
1040
  
Inhibitor
Name:
BDBM54378
Synonyms:
MLS001045934 N-[1-(2-chlorobenzyl)benzimidazol-2-yl]propionamide N-[1-[(2-chlorophenyl)methyl]benzimidazol-2-yl]propanamide cid_914315
Type:
Small organic molecule
Emp. Form.:
C17H16ClN3O
Mol. Mass.:
313.781
SMILES:
CCC(=O)Nc1nc2ccccc2n1Cc1ccccc1Cl
: