Target
Nucleotide-binding oligomerization domain-containing protein 2
Ligand
BDBM62383
Substrate
Meas. Tech.
SAR analysis of compounds that inhibit NOD2 revised
IC50
20000±n/a nM
Citation
 PubChem, PC SAR analysis of compounds that inhibit NOD2 revised PubChem Bioassay (2010)[AID] 
Target
Name:
Nucleotide-binding oligomerization domain-containing protein 2
Synonyms:
CARD15 IBD1 NOD2 Nucleotide-binding oligomerization domain-containing protein 2 | nucleotide-binding oligomerization domain containing 2
Type:
PROTEIN
Mol. Mass.:
115287.18
Organism:
Homo sapiens (Human)
Description:
ChEMBL_1454053
Residue:
1040
  
Inhibitor
Name:
BDBM62383
Synonyms:
MLS-0435457.0001 N-[1-[(4-chlorophenyl)methyl]-2-benzimidazolyl]-4-cyanobenzamide N-[1-[(4-chlorophenyl)methyl]benzimidazol-2-yl]-4-cyanobenzamide | cid_44543517
Type:
Small organic molecule
Emp. Form.:
C22H15ClN4O
Mol. Mass.:
386.834
SMILES:
Clc1ccc(Cn2c(NC(=O)c3ccc(cc3)C#N)nc3ccccc23)cc1
: