Target
Tumor necrosis factor
Ligand
BDBM62278
Substrate
Meas. Tech.
SAR analysis of inhibitors of TNFa specific NF-kB induction revised
IC50
<39.1±n/a nM
Citation
 PubChem, PC SAR analysis of inhibitors of TNFa specific NF-kB induction revised PubChem Bioassay (2010)[AID] 
Target
Name:
Tumor necrosis factor
Synonyms:
Cachectin TNF-a TNFA TNFSF2 Tumor necrosis factor (TNFa) Tumor necrosis factor ligand superfamily member 2 Tumor necrosis factor, soluble form | tumor necrosis factor alpha
Type:
Enzyme
Mol. Mass.:
25645.11
Organism:
Homo sapiens (Human)
Description:
P01375
Residue:
233
  
Inhibitor
Name:
BDBM62278
Synonyms:
2-bromobenzoic acid [2-[1-(2-methoxyethyl)-2,5-dimethyl-3-pyrrolyl]-2-oxoethyl] ester MLS-0243959.0001 [2-[1-(2-methoxyethyl)-2,5-dimethylpyrrol-3-yl]-2-oxoethyl] 2-bromobenzoate | cid_2401486
Type:
Small organic molecule
Emp. Form.:
C18H20BrNO4
Mol. Mass.:
394.26
SMILES:
COCCn1c(C)cc(C(=O)COC(=O)c2ccccc2Br)c1C
: