Target
Tumor necrosis factor
Ligand
BDBM54409
Substrate
Meas. Tech.
SAR analysis of inhibitors of TNFa specific NF-kB induction revised
IC50
140±n/a nM
Citation
 PubChem, PC SAR analysis of inhibitors of TNFa specific NF-kB induction revised PubChem Bioassay (2010)[AID] 
Target
Name:
Tumor necrosis factor
Synonyms:
Cachectin TNF-a TNFA TNFSF2 Tumor necrosis factor (TNFa) Tumor necrosis factor ligand superfamily member 2 Tumor necrosis factor, soluble form | tumor necrosis factor alpha
Type:
Enzyme
Mol. Mass.:
25645.11
Organism:
Homo sapiens (Human)
Description:
P01375
Residue:
233
  
Inhibitor
Name:
BDBM54409
Synonyms:
4-[4-(3,4-Dihydro-1H-isoquinolin-2-ylmethyl)-benzoylamino]-benzoic acid ethyl ester 4-[[[4-(3,4-dihydro-1H-isoquinolin-2-ylmethyl)phenyl]-oxomethyl]amino]benzoic acid ethyl ester MLS001209846 cid_1106361 ethyl 4-[[4-(3,4-dihydro-1H-isoquinolin-2-ylmethyl)phenyl]carbonylamino]benzoate
Type:
Small organic molecule
Emp. Form.:
C26H26N2O3
Mol. Mass.:
414.4962
SMILES:
CCOC(=O)c1ccc(NC(=O)c2ccc(CN3CCc4ccccc4C3)cc2)cc1
: