Target
G-protein coupled receptor 35
Ligand
BDBM62390
Substrate
Meas. Tech.
SAR analysis of Antagonists of the GPR35 Receptor using an Image-Based Assay
IC50
32000±n/a nM
Citation
 PubChem, PC SAR analysis of Antagonists of the GPR35 Receptor using an Image-Based Assay PubChem Bioassay (2010)[AID] 
Target
Name:
G-protein coupled receptor 35
Synonyms:
G protein-coupled receptor 35 GPR35_HUMAN
Type:
Enzyme Catalytic Domain
Mol. Mass.:
34085.57
Organism:
Homo sapiens (Human)
Description:
gi_33695097
Residue:
309
  
Inhibitor
Name:
BDBM62390
Synonyms:
2-[(7-methoxy-4-methyl-[1,2,4]triazolo[4,3-a]quinolin-1-yl)sulfanyl]-N-methyl-N-(4-phenyl-1,3-thiazol-2-yl)acetamide 2-[(7-methoxy-4-methyl-[1,2,4]triazolo[4,3-a]quinolin-1-yl)thio]-N-methyl-N-(4-phenyl-2-thiazolyl)acetamide MLS-0102574.0001 | cid_1135734
Type:
Small organic molecule
Emp. Form.:
C24H21N5O2S2
Mol. Mass.:
475.586
SMILES:
COc1ccc2c(c1)cc(C)c1nnc(SCC(=O)N(C)c3nc(cs3)-c3ccccc3)n21
: